Target
Monoglyceride lipase
Ligand
BDBM50562160
Substrate
Meas. Tech.
ChEMBL_2077554 (CHEMBL4733345)
IC50
18±n/a nM
Citation
 Granchi, CBononi, GFerrisi, RGori, EMantini, GGlasmacher, SPoli, GPalazzolo, SCaligiuri, IRizzolio, FCanzonieri, VPerin, TGertsch, JSodi, AGiovannetti, EMacchia, MMinutolo, FTuccinardi, TChicca, A Design, synthesis and biological evaluation of second-generation benzoylpiperidine derivatives as reversible monoacylglycerol lipase (MAGL) inhibitors. Eur J Med Chem 209:0 (2021)  
Target
Name:
Monoglyceride lipase
Synonyms:
HU-K5 Lysophospholipase-like MGL MGLL_HUMAN
Type:
Hydrolase
Mol. Mass.:
33264.56
Organism:
Homo sapiens (Human)
Description:
Human recombinant MGL (Cayman Chemical, cat# 10008354).
Residue:
303
  
Inhibitor
Name:
BDBM50562160
Synonyms:
CHEMBL4757403
Type:
Small organic molecule
Emp. Form.:
C25H21F2NO3S
Mol. Mass.:
453.501
SMILES:
Oc1cc(C(=O)N2CCC(CC2)C(=O)c2ccc(Sc3ccccc3)cc2)c(F)cc1F
: