Target
Transient receptor potential cation channel subfamily V member 1
Ligand
BDBM50562521
Substrate
Meas. Tech.
ChEMBL_2079017 (CHEMBL4734808)
EC50
3.2±n/a nM
Citation
 Å Nilsson, JLMallet, CShionoya, KBlomgren, ASundin, APGrundemar, LBoudieu, LBlomqvist, AEschalier, ANilsson, UJZygmunt, PM Paracetamol analogues conjugated by FAAH induce TRPV1-mediated antinociception without causing acute liver toxicity. Eur J Med Chem 213:0 (2021)  
Target
Name:
Transient receptor potential cation channel subfamily V member 1
Synonyms:
Capsaicin receptor TRPV1_RAT Trpv1 Vanilloid VR1 Vanilloid receptor 1 (VRI/TRPV1) Vanilloid receptor type 1-like (TrpV1/Vr1) Vr1l | osm-9-like TRP channel 1
Type:
Transient Receptor
Mol. Mass.:
94956.12
Organism:
Rattus norvegicus (rat)
Description:
O35433
Residue:
838
  
Inhibitor
Name:
BDBM50562521
Synonyms:
CHEMBL4747170
Type:
Small organic molecule
Emp. Form.:
C27H39NO3
Mol. Mass.:
425.6035
SMILES:
CCCCC\C=C/C\C=C/C\C=C/C\C=C/CCCC(=O)Nc1ccc(OC)c(O)c1
: