Target
Transient receptor potential cation channel subfamily V member 1
Ligand
BDBM50562522
Substrate
Meas. Tech.
ChEMBL_2079017 (CHEMBL4734808)
EC50
4.0±n/a nM
Citation
 Å Nilsson, JLMallet, CShionoya, KBlomgren, ASundin, APGrundemar, LBoudieu, LBlomqvist, AEschalier, ANilsson, UJZygmunt, PM Paracetamol analogues conjugated by FAAH induce TRPV1-mediated antinociception without causing acute liver toxicity. Eur J Med Chem 213:0 (2021)  
Target
Name:
Transient receptor potential cation channel subfamily V member 1
Synonyms:
Capsaicin receptor TRPV1_RAT Trpv1 Vanilloid VR1 Vanilloid receptor 1 (VRI/TRPV1) Vanilloid receptor type 1-like (TrpV1/Vr1) Vr1l | osm-9-like TRP channel 1
Type:
Transient Receptor
Mol. Mass.:
94956.12
Organism:
Rattus norvegicus (rat)
Description:
O35433
Residue:
838
  
Inhibitor
Name:
BDBM50562522
Synonyms:
CHEMBL4778235
Type:
Small organic molecule
Emp. Form.:
C28H39N3O
Mol. Mass.:
433.6288
SMILES:
CCCCC\C=C/C\C=C/C\C=C/C\C=C/CCCC(=O)NCc1ccc2[nH]ncc2c1
: