Target
Chloroquine resistance transporter
Ligand
BDBM50563440
Substrate
Meas. Tech.
ChEMBL_2082532 (CHEMBL4738323)
IC50
55000±n/a nM
Citation
 Relitti, NFederico, SPozzetti, LButini, SLamponi, STaramelli, DD'Alessandro, SMartin, REShafik, SHSummers, RLBabij, SKHabluetzel, ATapanelli, SCaldelari, RGemma, SCampiani, G Synthesis and biological evaluation of benzhydryl-based antiplasmodial agents possessing Plasmodium falciparum chloroquine resistance transporter (PfCRT) inhibitory activity. Eur J Med Chem 215:0 (2021)  
Target
Name:
Chloroquine resistance transporter
Synonyms:
CRT PfCRT
Type:
PROTEIN
Mol. Mass.:
48687.29
Organism:
Plasmodium falciparum
Description:
ChEMBL_1364181
Residue:
424
  
Inhibitor
Name:
BDBM50563440
Synonyms:
CHEMBL4784051
Type:
Small organic molecule
Emp. Form.:
C28H28ClN3O
Mol. Mass.:
457.994
SMILES:
COc1cc(NC(c2ccc(CN3CCCC3)cc2)c2cccc(Cl)c2)c2ncccc2c1
: