Target
Nuclear receptor ROR-gamma
Ligand
BDBM441812
Substrate
Meas. Tech.
ChEMBL_2091329 (CHEMBL4772592)
IC50
46±n/a nM
Citation
 Sun, NHuang, YYu, MZhao, YChen, JAZhu, CSong, MGuo, HXie, QWang, Y Discovery of carboxyl-containing biaryl ureas as potent ROR?t inverse agonists. Eur J Med Chem 202:0 (2020)  
Target
Name:
Nuclear receptor ROR-gamma
Synonyms:
NR1F3 Nuclear receptor ROR-gamma (RORC) RAR-related orphan receptor C (RORc) RORG RZRG Retinoid-related orphan receptor-gamma (RORc)
Type:
Enzyme Catalytic Domain
Mol. Mass.:
58218.40
Organism:
Homo sapiens (Human)
Description:
P51449
Residue:
518
  
Inhibitor
Name:
BDBM441812
Synonyms:
US10647665, Example I-1
Type:
Small organic molecule
Emp. Form.:
C23H19Cl2F3N2O4S
Mol. Mass.:
547.374
SMILES:
CCS(=O)(=O)c1ccc(CNC(=O)Nc2cc(Cl)c(c(Cl)c2)-c2ccccc2OC(F)(F)F)cc1
: