Target
Endoplasmic reticulum aminopeptidase 2
Ligand
BDBM50570142
Substrate
Meas. Tech.
ChEMBL_2111174 (CHEMBL4820024)
IC50
22000±n/a nM
Citation
 Laura, MRonan, GVy, LBValentin, GOmar, CAVirgyl, CPiveteau, CMelissa, RCharlotte, FSandrine, WJulie, CJulie, DRDamien, BFlorence, LPeter, VEBenoit, DRebecca, DP Modulators of hERAP2 discovered by high-throughput screening. Eur J Med Chem 211:0 (2021)  
Target
Name:
Endoplasmic reticulum aminopeptidase 2
Synonyms:
Aminopeptidase ERAP2_HUMAN | LRAP
Type:
PROTEIN
Mol. Mass.:
110463.90
Organism:
Homo sapiens (Human)
Description:
ChEMBL_1473169
Residue:
960
  
Inhibitor
Name:
BDBM50570142
Synonyms:
CHEMBL4878060
Type:
Small organic molecule
Emp. Form.:
C30H32N4O3
Mol. Mass.:
496.6001
SMILES:
OC(=O)CN(CC(=O)N1CCN(Cc2ccccc2)C[C@@H]1Cc1c[nH]c2ccccc12)c1ccccc1
: