Target
Endoplasmic reticulum aminopeptidase 2
Ligand
BDBM50570140
Substrate
Meas. Tech.
ChEMBL_2111174 (CHEMBL4820024)
IC50
9700±n/a nM
Citation
 Laura, MRonan, GVy, LBValentin, GOmar, CAVirgyl, CPiveteau, CMelissa, RCharlotte, FSandrine, WJulie, CJulie, DRDamien, BFlorence, LPeter, VEBenoit, DRebecca, DP Modulators of hERAP2 discovered by high-throughput screening. Eur J Med Chem 211:0 (2021)  
Target
Name:
Endoplasmic reticulum aminopeptidase 2
Synonyms:
Aminopeptidase ERAP2_HUMAN | LRAP
Type:
PROTEIN
Mol. Mass.:
110463.90
Organism:
Homo sapiens (Human)
Description:
ChEMBL_1473169
Residue:
960
  
Inhibitor
Name:
BDBM50570140
Synonyms:
CHEMBL4863321
Type:
Small organic molecule
Emp. Form.:
C29H32FN3O5S
Mol. Mass.:
553.645
SMILES:
CN([C@@H](Cc1ccccc1)C(O)=O)C(=O)c1ccc(cc1)N(CCN1CCCC1)S(=O)(=O)c1ccc(F)cc1
: