Target
Interleukin-1 receptor antagonist protein
Ligand
BDBM50570140
Substrate
Meas. Tech.
ChEMBL_2111177 (CHEMBL4820027)
IC50
100000±n/a nM
Citation
 Laura, MRonan, GVy, LBValentin, GOmar, CAVirgyl, CPiveteau, CMelissa, RCharlotte, FSandrine, WJulie, CJulie, DRDamien, BFlorence, LPeter, VEBenoit, DRebecca, DP Modulators of hERAP2 discovered by high-throughput screening. Eur J Med Chem 211:0 (2021)  
Target
Name:
Interleukin-1 receptor antagonist protein
Synonyms:
ICIL-1RA IL-1ra IL1F3 IL1RA_HUMAN INN=Anakinra Interleukin-1 receptor antagonist protein
Type:
PROTEIN
Mol. Mass.:
20053.78
Organism:
Homo sapiens
Description:
ChEMBL_118941
Residue:
177
  
Inhibitor
Name:
BDBM50570140
Synonyms:
CHEMBL4863321
Type:
Small organic molecule
Emp. Form.:
C29H32FN3O5S
Mol. Mass.:
553.645
SMILES:
CN([C@@H](Cc1ccccc1)C(O)=O)C(=O)c1ccc(cc1)N(CCN1CCCC1)S(=O)(=O)c1ccc(F)cc1
: