Target
Endoplasmic reticulum aminopeptidase 2
Ligand
BDBM50077017
Substrate
Meas. Tech.
ChEMBL_2111180 (CHEMBL4820030)
IC50
>100000±n/a nM
Citation
 Laura, MRonan, GVy, LBValentin, GOmar, CAVirgyl, CPiveteau, CMelissa, RCharlotte, FSandrine, WJulie, CJulie, DRDamien, BFlorence, LPeter, VEBenoit, DRebecca, DP Modulators of hERAP2 discovered by high-throughput screening. Eur J Med Chem 211:0 (2021)  
Target
Name:
Endoplasmic reticulum aminopeptidase 2
Synonyms:
Aminopeptidase ERAP2_HUMAN | LRAP
Type:
PROTEIN
Mol. Mass.:
110463.90
Organism:
Homo sapiens (Human)
Description:
ChEMBL_1473169
Residue:
960
  
Inhibitor
Name:
BDBM50077017
Synonyms:
CHEMBL3416725
Type:
Small organic molecule
Emp. Form.:
C23H30N4O5
Mol. Mass.:
442.5081
SMILES:
CCCC[C@H](N)C(=O)Nc1ccc(cc1N)C(=O)N[C@@H](Cc1ccc(O)cc1)C(=O)OC
: