Target
Endoplasmic reticulum aminopeptidase 1
Ligand
BDBM50076744
Substrate
Meas. Tech.
ChEMBL_2111181 (CHEMBL4820031)
IC50
43000±n/a nM
Citation
 Laura, MRonan, GVy, LBValentin, GOmar, CAVirgyl, CPiveteau, CMelissa, RCharlotte, FSandrine, WJulie, CJulie, DRDamien, BFlorence, LPeter, VEBenoit, DRebecca, DP Modulators of hERAP2 discovered by high-throughput screening. Eur J Med Chem 211:0 (2021)  
Target
Name:
Endoplasmic reticulum aminopeptidase 1
Synonyms:
APPILS Aminopeptidase ERAP1_HUMAN | KIAA0525
Type:
PROTEIN
Mol. Mass.:
107232.03
Organism:
Homo sapiens (Human)
Description:
ChEMBL_1473167
Residue:
941
  
Inhibitor
Name:
BDBM50076744
Synonyms:
CHEMBL3416733
Type:
Small organic molecule
Emp. Form.:
C27H37N4O4P
Mol. Mass.:
512.5808
SMILES:
CC(C)C[C@H](CP(O)(=O)[C@@H](N)CCc1ccccc1)C(=O)N[C@@H](Cc1c[nH]c2ccccc12)C(N)=O
: