Target
Melanocortin receptor 3
Ligand
BDBM50138296
Substrate
Meas. Tech.
ChEBML_106012
IC50
>10000±n/a nM
Citation
 Xi, NHale, CKelly, MGNorman, MHStec, MXu, SBaumgartner, JWFotsch, C Synthesis of novel melanocortin 4 receptor agonists and antagonists containing a succinamide core. Bioorg Med Chem Lett 14:377-81 (2003)  
Target
Name:
Melanocortin receptor 3
Synonyms:
MC3-R MC3R_HUMAN Melanocortin receptor (M3 and M4)
Type:
Enzyme
Mol. Mass.:
36044.86
Organism:
Homo sapiens (Human)
Description:
P41968
Residue:
323
  
Inhibitor
Name:
BDBM50138296
Synonyms:
(S)-4-(4-{2-[1-(Acetyl-ethyl-amino)-ethyl]-phenyl}-piperazin-1-yl)-3-(4-chloro-benzyl)-N-cyclobutyl-4-oxo-butyramide | CHEMBL125819
Type:
Small organic molecule
Emp. Form.:
C31H41ClN4O3
Mol. Mass.:
553.135
SMILES:
CCN(C(C)c1ccccc1N1CCN(CC1)C(=O)[C@H](CC(=O)NC1CCC1)Cc1ccc(Cl)cc1)C(C)=O
: