Target
Sodium- and chloride-dependent glycine transporter 2
Ligand
BDBM50138559
Substrate
Meas. Tech.
ChEBML_70977
IC50
58±n/a nM
Citation
 Ho, KKAppell, KCBaldwin, JJBohnstedt, ACDong, GGuo, THorlick, RIslam, KRKultgen, SGMasterson, CMMcDonald, EMcMillan, KMorphy, JRRankovic, ZSundaram, HWebb, M 2-(Aminomethyl)-benzamide-based glycine transporter type-2 inhibitors. Bioorg Med Chem Lett 14:545-8 (2003)  
Target
Name:
Sodium- and chloride-dependent glycine transporter 2
Synonyms:
GLYT2 NET1 SLC6A5 | Sodium- and chloride-dependent glycine transporter 2
Type:
Enzyme Catalytic Domain
Mol. Mass.:
87438.56
Organism:
Homo sapiens (Human)
Description:
Glycine-2-transporter 0 HUMAN::Q9Y345
Residue:
797
  
Inhibitor
Name:
BDBM50138559
Synonyms:
2-(7-Hydroxy-1,2,4,5-tetrahydro-benzo[d]azepin-3-ylmethyl)-N-(4-phenyl-but-3-enyl)-benzamide | CHEMBL150560
Type:
Small organic molecule
Emp. Form.:
C28H30N2O2
Mol. Mass.:
426.55
SMILES:
Oc1ccc2CCN(Cc3ccccc3C(=O)NCC\C=C\c3ccccc3)CCc2c1
: