Target
Sodium- and chloride-dependent glycine transporter 2
Ligand
BDBM50138594
Substrate
Meas. Tech.
ChEBML_70977
IC50
33±n/a nM
Citation
 Ho, KKAppell, KCBaldwin, JJBohnstedt, ACDong, GGuo, THorlick, RIslam, KRKultgen, SGMasterson, CMMcDonald, EMcMillan, KMorphy, JRRankovic, ZSundaram, HWebb, M 2-(Aminomethyl)-benzamide-based glycine transporter type-2 inhibitors. Bioorg Med Chem Lett 14:545-8 (2003)  
Target
Name:
Sodium- and chloride-dependent glycine transporter 2
Synonyms:
GLYT2 NET1 SLC6A5 | Sodium- and chloride-dependent glycine transporter 2
Type:
Enzyme Catalytic Domain
Mol. Mass.:
87438.56
Organism:
Homo sapiens (Human)
Description:
Glycine-2-transporter 0 HUMAN::Q9Y345
Residue:
797
  
Inhibitor
Name:
BDBM50138594
Synonyms:
2-(5-Hydroxy-1,3-dihydro-isoindol-2-ylmethyl)-N-(4-phenyl-but-3-enyl)-benzamide | CHEMBL358473
Type:
Small organic molecule
Emp. Form.:
C26H26N2O2
Mol. Mass.:
398.4968
SMILES:
Oc1ccc2CN(Cc3ccccc3C(=O)NCC\C=C\c3ccccc3)Cc2c1
: