Target
Fibroblast growth factor receptor 4
Ligand
BDBM50575048
Substrate
Meas. Tech.
ChEMBL_2123929 (CHEMBL4833162)
IC50
0.550000±n/a nM
Citation
 Pan, CNie, WWang, JDu, JPan, ZGao, JLu, YChe, JZhu, HDai, HChen, BHe, QDong, X Design, synthesis and biological evaluation of quinazoline derivatives as potent and selective FGFR4 inhibitors. Eur J Med Chem 225:0 (2021)  
Target
Name:
Fibroblast growth factor receptor 4
Synonyms:
CD_antigen: CD334 FGFR4 FGFR4 Fibroblast growth factor receptor JK2 TKF
Type:
Protein
Mol. Mass.:
87957.45
Organism:
Homo sapiens (Human)
Description:
P22455
Residue:
802
  
Inhibitor
Name:
BDBM50575048
Synonyms:
CHEMBL4866267
Type:
Small organic molecule
Emp. Form.:
C33H36Cl2N6O3
Mol. Mass.:
635.583
SMILES:
COc1cc(OC)c(Cl)c(c1Cl)-c1ccc2nc(Nc3c(C)cc(CCN4CCN(C)CC4)cc3NC(=O)C=C)ncc2c1
: