Target
Integrin alpha-L/Integrin beta-2/Intercellular adhesion molecule 1
Ligand
BDBM50144068
Substrate
Meas. Tech.
ChEMBL_224216 (CHEMBL845191)
IC50
8900±n/a nM
Citation
 Burdick, DJMarsters, JCAliagas-Martin, IStanley, MBeresini, MClark, KMcDowell, RSGadek, TR N-Benzoyl amino acids as ICAM/LFA-1 inhibitors. Part 2: structure-activity relationship of the benzoyl moiety. Bioorg Med Chem Lett 14:2055-9 (2004)  
Target
Name:
Integrin alpha-L/Integrin beta-2/Intercellular adhesion molecule 1
Synonyms:
Integrin beta-2/Intercellular adhesion molecule-1 /Leukocyte adhesion glycoprotein LFA-1 alpha | Intercellular adhesion molecule (ICAM-1), Integrin alpha-L/beta-2
Type:
Mol. Mass.:
Description:
ASSAY_ID of EBI is 97281
Components:
This complex has 3 components.
Component 1
Name:
Integrin alpha-L
Synonyms:
CD11 antigen-like family member A CD_antigen=CD11a ITGAL LFA-1A Leukocyte adhesion glycoprotein LFA-1 alpha chain | Leukocyte function-associated molecule 1 alpha chain
Type:
PROTEIN
Mol. Mass.:
128748.90
Organism:
Homo sapiens (Human)
Description:
ChEMBL_629045
Residue:
1170
  
Component 2
Name:
Intercellular adhesion molecule 1
Synonyms:
CD_antigen=CD54 ICAM1 Intercellular adhesion molecule (ICAM-1), Integrin alpha-L/beta-2 Intercellular adhesion molecule-1 | Major group rhinovirus receptor
Type:
PROTEIN
Mol. Mass.:
57831.10
Organism:
Homo sapiens (Human)
Description:
ChEMBL_826675
Residue:
532
  
Component 3
Name:
Integrin beta-2
Synonyms:
CD18 ITGB2 MFI7
Type:
PROTEIN
Mol. Mass.:
84785.60
Organism:
Homo sapiens (Human)
Description:
EBI_12662
Residue:
769
  
Inhibitor
Name:
BDBM50144068
Synonyms:
(S)-3-(1H-Indol-3-yl)-2-(2-iodo-benzoylamino)-propionic acid | CHEMBL294355
Type:
Small organic molecule
Emp. Form.:
C18H15IN2O3
Mol. Mass.:
434.2278
SMILES:
OC(=O)[C@H](Cc1c[nH]c2ccccc12)NC(=O)c1ccccc1I
: