Target
Corticotropin-releasing factor receptor 1
Ligand
BDBM50145728
Substrate
Meas. Tech.
ChEMBL_51106 (CHEMBL666467)
Ki
3295±n/a nM
Citation
 Molteni, VPenzotti, JWilson, DMTermin, APMao, LCrane, CMHassman, FWang, TWong, HMiller, KJGrossman, SGrootenhuis, PD N-phenylphenylglycines as novel corticotropin releasing factor receptor antagonists. J Med Chem 47:2426-9 (2004)  
Target
Name:
Corticotropin-releasing factor receptor 1
Synonyms:
CRF-R CRF1 CRFR1 CRH-R 1 CRHR1 Corticotropin-releasing factor receptor 1 (CRF-1) Corticotropin-releasing hormone receptor 1
Type:
Enzyme
Mol. Mass.:
50744.31
Organism:
Homo sapiens (Human)
Description:
P34998
Residue:
444
  
Inhibitor
Name:
BDBM50145728
Synonyms:
1-(2-Chloro-4-methyl-phenylamino)-1-(2-isopropyl-phenyl)-4-pyridin-4-yl-butan-2-one | CHEMBL310343
Type:
Small organic molecule
Emp. Form.:
C25H27ClN2O
Mol. Mass.:
406.948
SMILES:
CC(C)c1ccccc1C(Nc1ccc(C)cc1Cl)C(=O)CCc1ccncc1
: