Target
Corticotropin-releasing factor receptor 1
Ligand
BDBM50145730
Substrate
Meas. Tech.
ChEMBL_51105 (CHEMBL666466)
Ki
1035±n/a nM
Citation
 Molteni, VPenzotti, JWilson, DMTermin, APMao, LCrane, CMHassman, FWang, TWong, HMiller, KJGrossman, SGrootenhuis, PD N-phenylphenylglycines as novel corticotropin releasing factor receptor antagonists. J Med Chem 47:2426-9 (2004)  
Target
Name:
Corticotropin-releasing factor receptor 1
Synonyms:
CRF-R CRF1 CRFR1 CRH-R 1 CRHR1 Corticotropin-releasing factor receptor 1 (CRF-1) Corticotropin-releasing hormone receptor 1
Type:
Enzyme
Mol. Mass.:
50744.31
Organism:
Homo sapiens (Human)
Description:
P34998
Residue:
444
  
Inhibitor
Name:
BDBM50145730
Synonyms:
1-(2-Bromo-phenyl)-1-(2-chloro-4-methyl-phenylamino)-4-pyridin-4-yl-butan-2-one | CHEMBL83914
Type:
Small organic molecule
Emp. Form.:
C22H20BrClN2O
Mol. Mass.:
443.764
SMILES:
Cc1ccc(NC(C(=O)CCc2ccncc2)c2ccccc2Br)c(Cl)c1
: