Target
Corticotropin-releasing factor receptor 1
Ligand
BDBM50145739
Substrate
Meas. Tech.
ChEMBL_51106 (CHEMBL666467)
Ki
514±n/a nM
Citation
 Molteni, VPenzotti, JWilson, DMTermin, APMao, LCrane, CMHassman, FWang, TWong, HMiller, KJGrossman, SGrootenhuis, PD N-phenylphenylglycines as novel corticotropin releasing factor receptor antagonists. J Med Chem 47:2426-9 (2004)  
Target
Name:
Corticotropin-releasing factor receptor 1
Synonyms:
CRF-R CRF1 CRFR1 CRH-R 1 CRHR1 Corticotropin-releasing factor receptor 1 (CRF-1) Corticotropin-releasing hormone receptor 1
Type:
Enzyme
Mol. Mass.:
50744.31
Organism:
Homo sapiens (Human)
Description:
P34998
Residue:
444
  
Inhibitor
Name:
BDBM50145739
Synonyms:
CHEMBL81912 | N-{3-[2-(2-Bromo-phenyl)-2-(2,4-dichloro-phenylamino)-acetyl]-phenyl}-acetamide
Type:
Small organic molecule
Emp. Form.:
C22H17BrCl2N2O2
Mol. Mass.:
492.193
SMILES:
CC(=O)Nc1cccc(c1)C(=O)C(Nc1ccc(Cl)cc1Cl)c1ccccc1Br
: