Target
Corticotropin-releasing factor receptor 1
Ligand
BDBM50145761
Substrate
Meas. Tech.
ChEMBL_51106 (CHEMBL666467)
Ki
3180±n/a nM
Citation
 Molteni, VPenzotti, JWilson, DMTermin, APMao, LCrane, CMHassman, FWang, TWong, HMiller, KJGrossman, SGrootenhuis, PD N-phenylphenylglycines as novel corticotropin releasing factor receptor antagonists. J Med Chem 47:2426-9 (2004)  
Target
Name:
Corticotropin-releasing factor receptor 1
Synonyms:
CRF-R CRF1 CRFR1 CRH-R 1 CRHR1 Corticotropin-releasing factor receptor 1 (CRF-1) Corticotropin-releasing hormone receptor 1
Type:
Enzyme
Mol. Mass.:
50744.31
Organism:
Homo sapiens (Human)
Description:
P34998
Residue:
444
  
Inhibitor
Name:
BDBM50145761
Synonyms:
(S)-1-(2,4-Dichloro-phenylamino)-4-pyridin-4-yl-1-o-tolyl-butan-2-one | CHEMBL81760
Type:
Small organic molecule
Emp. Form.:
C22H20Cl2N2O
Mol. Mass.:
399.313
SMILES:
Cc1ccccc1[C@H](Nc1ccc(Cl)cc1Cl)C(=O)CCc1ccncc1
: