Target
Corticotropin-releasing factor receptor 1
Ligand
BDBM50145755
Substrate
Meas. Tech.
ChEMBL_51106 (CHEMBL666467)
Ki
641±n/a nM
Citation
 Molteni, VPenzotti, JWilson, DMTermin, APMao, LCrane, CMHassman, FWang, TWong, HMiller, KJGrossman, SGrootenhuis, PD N-phenylphenylglycines as novel corticotropin releasing factor receptor antagonists. J Med Chem 47:2426-9 (2004)  
Target
Name:
Corticotropin-releasing factor receptor 1
Synonyms:
CRF-R CRF1 CRFR1 CRH-R 1 CRHR1 Corticotropin-releasing factor receptor 1 (CRF-1) Corticotropin-releasing hormone receptor 1
Type:
Enzyme
Mol. Mass.:
50744.31
Organism:
Homo sapiens (Human)
Description:
P34998
Residue:
444
  
Inhibitor
Name:
BDBM50145755
Synonyms:
1-(4-Methyl-2-trifluoromethyl-phenylamino)-4-pyridin-4-yl-1-o-tolyl-butan-2-one | CHEMBL78721
Type:
Small organic molecule
Emp. Form.:
C24H23F3N2O
Mol. Mass.:
412.4474
SMILES:
Cc1ccc(NC(C(=O)CCc2ccncc2)c2ccccc2C)c(c1)C(F)(F)F
: