Target
Corticotropin-releasing factor receptor 1
Ligand
BDBM50145764
Substrate
Meas. Tech.
ChEMBL_51106 (CHEMBL666467)
Ki
1075±n/a nM
Citation
 Molteni, VPenzotti, JWilson, DMTermin, APMao, LCrane, CMHassman, FWang, TWong, HMiller, KJGrossman, SGrootenhuis, PD N-phenylphenylglycines as novel corticotropin releasing factor receptor antagonists. J Med Chem 47:2426-9 (2004)  
Target
Name:
Corticotropin-releasing factor receptor 1
Synonyms:
CRF-R CRF1 CRFR1 CRH-R 1 CRHR1 Corticotropin-releasing factor receptor 1 (CRF-1) Corticotropin-releasing hormone receptor 1
Type:
Enzyme
Mol. Mass.:
50744.31
Organism:
Homo sapiens (Human)
Description:
P34998
Residue:
444
  
Inhibitor
Name:
BDBM50145764
Synonyms:
3-[2-(2-Bromo-phenyl)-2-(2-chloro-4-methyl-phenylamino)-acetyl]-N-methyl-benzamide | CHEMBL309244
Type:
Small organic molecule
Emp. Form.:
C23H20BrClN2O2
Mol. Mass.:
471.774
SMILES:
CNC(=O)c1cccc(c1)C(=O)C(Nc1ccc(C)cc1Cl)c1ccccc1Br
: