Target
Choline kinase alpha
Ligand
BDBM50579740
Substrate
Meas. Tech.
ChEMBL_2145375 (CHEMBL5029655)
IC50
332±n/a nM
Citation
 Quartieri, FNesi, MAvanzi, NRBorghi, DCasale, ECorti, ECucchi, UDonati, DFasolini, MFelder, ERGalvani, AGiorgini, MLLomolino, AMenichincheri, MOrrenius, CPerrera, CRe Depaolini, SRiccardi-Sirtori, FSalsi, EIsacchi, AGnocchi, P Identification of unprecedented ATP-competitive choline kinase inhibitors. Bioorg Med Chem Lett 51:0 (2021)  
Target
Name:
Choline kinase alpha
Synonyms:
CHK CHKA_HUMAN Choline kinase alpha
Type:
PROTEIN
Mol. Mass.:
52248.44
Organism:
Homo sapiens (Human)
Description:
ChEMBL_1290064
Residue:
457
  
Inhibitor
Name:
BDBM50579740
Synonyms:
CHEMBL5075081
Type:
Small organic molecule
Emp. Form.:
C19H22N6O2
Mol. Mass.:
366.417
SMILES:
COc1cccc(NC(=O)[C@H]2CC[C@H](CC2)n2cnc3c(N)ncnc23)c1
: