Target
Choline kinase alpha
Ligand
BDBM50579748
Substrate
Meas. Tech.
ChEMBL_2145375 (CHEMBL5029655)
IC50
495±n/a nM
Citation
 Quartieri, FNesi, MAvanzi, NRBorghi, DCasale, ECorti, ECucchi, UDonati, DFasolini, MFelder, ERGalvani, AGiorgini, MLLomolino, AMenichincheri, MOrrenius, CPerrera, CRe Depaolini, SRiccardi-Sirtori, FSalsi, EIsacchi, AGnocchi, P Identification of unprecedented ATP-competitive choline kinase inhibitors. Bioorg Med Chem Lett 51:0 (2021)  
Target
Name:
Choline kinase alpha
Synonyms:
CHK CHKA_HUMAN Choline kinase alpha
Type:
PROTEIN
Mol. Mass.:
52248.44
Organism:
Homo sapiens (Human)
Description:
ChEMBL_1290064
Residue:
457
  
Inhibitor
Name:
BDBM50579748
Synonyms:
CHEMBL5093175
Type:
Small organic molecule
Emp. Form.:
C22H24N8O2
Mol. Mass.:
432.4784
SMILES:
COc1cccc(NC(=O)[C@H]2CC[C@H](CC2)n2cnc3c(N)nc(nc23)-c2cc[nH]n2)c1
: