Target
Choline kinase alpha
Ligand
BDBM50579767
Substrate
Meas. Tech.
ChEMBL_2145375 (CHEMBL5029655)
IC50
104±n/a nM
Citation
 Quartieri, FNesi, MAvanzi, NRBorghi, DCasale, ECorti, ECucchi, UDonati, DFasolini, MFelder, ERGalvani, AGiorgini, MLLomolino, AMenichincheri, MOrrenius, CPerrera, CRe Depaolini, SRiccardi-Sirtori, FSalsi, EIsacchi, AGnocchi, P Identification of unprecedented ATP-competitive choline kinase inhibitors. Bioorg Med Chem Lett 51:0 (2021)  
Target
Name:
Choline kinase alpha
Synonyms:
CHK CHKA_HUMAN Choline kinase alpha
Type:
PROTEIN
Mol. Mass.:
52248.44
Organism:
Homo sapiens (Human)
Description:
ChEMBL_1290064
Residue:
457
  
Inhibitor
Name:
BDBM50579767
Synonyms:
CHEMBL5089440
Type:
Small organic molecule
Emp. Form.:
C16H15ClF3N7OS
Mol. Mass.:
445.85
SMILES:
Nc1nc(Cl)nc2n(cnc12)[C@@H]1CC[C@@H](CC1)C(=O)Nc1nc(cs1)C(F)(F)F
: