Target
Choline kinase alpha
Ligand
BDBM50579786
Substrate
Meas. Tech.
ChEMBL_2145375 (CHEMBL5029655)
IC50
31±n/a nM
Citation
 Quartieri, FNesi, MAvanzi, NRBorghi, DCasale, ECorti, ECucchi, UDonati, DFasolini, MFelder, ERGalvani, AGiorgini, MLLomolino, AMenichincheri, MOrrenius, CPerrera, CRe Depaolini, SRiccardi-Sirtori, FSalsi, EIsacchi, AGnocchi, P Identification of unprecedented ATP-competitive choline kinase inhibitors. Bioorg Med Chem Lett 51:0 (2021)  
Target
Name:
Choline kinase alpha
Synonyms:
CHK CHKA_HUMAN Choline kinase alpha
Type:
PROTEIN
Mol. Mass.:
52248.44
Organism:
Homo sapiens (Human)
Description:
ChEMBL_1290064
Residue:
457
  
Inhibitor
Name:
BDBM50579786
Synonyms:
CHEMBL5093152
Type:
Small organic molecule
Emp. Form.:
C22H29FN8OS
Mol. Mass.:
472.582
SMILES:
CC1(C)Cc2nc(NC(=O)[C@H]3CC[C@H](CC3)n3cnc4c(N)nc(F)nc34)sc2C(C)(C)N1
: