Target
High affinity nerve growth factor receptor
Ligand
BDBM50584720
Substrate
Meas. Tech.
ChEMBL_2160389 (CHEMBL5045139)
Ki
11±n/a nM
Citation
 Pan, SZhang, LLuo, XNan, JYang, WBin, HLi, YHuang, QWang, TPan, ZMu, BWang, FTian, CLiu, YLi, LYang, S Structural Optimization and Structure-Activity Relationship Studies of 6,6-Dimethyl-4-(phenylamino)-6 J Med Chem 65:2035-2058 (2022)  
Target
Name:
High affinity nerve growth factor receptor
Synonyms:
2.7.10.1 NTRK1 NTRK1_HUMAN Neurotrophic tyrosine kinase receptor type 1 Synonyms=MTC TRK1-transforming tyrosine kinase protein TRKA GN Trk-A Tropomyosin-related kinase A Tyrosine kinase receptor Tyrosine kinase receptor A Tyrosine kinase receptor A (Trk-A) gp140trk | p140-TrkA
Type:
Mol. Mass.:
87498.18
Organism:
Homo sapiens (Human)
Description:
P04629
Residue:
796
  
Inhibitor
Name:
BDBM50584720
Synonyms:
CHEMBL5088153
Type:
Small organic molecule
Emp. Form.:
C29H31ClN8O3
Mol. Mass.:
575.061
SMILES:
Cc1cc(NC(=O)Nc2cc(nn2-c2ccc(Cl)cc2)C(C)(C)C)ccc1Nc1ncnc2NC(=O)C(C)(C)Oc12
: