Target
Trypsin
Ligand
BDBM50157093
Substrate
Meas. Tech.
ChEMBL_302473 (CHEMBL826338)
Ki
31±n/a nM
Citation
 Bruncko, MMcClellan, WJWendt, MDSauer, DRGeyer, ADalton, CRKaminski, MAWeitzberg, MGong, JDellaria, JFMantei, RZhao, XNienaber, VLStewart, KKlinghofer, VBouska, JRockway, TWGiranda, VL Naphthamidine urokinase plasminogen activator inhibitors with improved pharmacokinetic properties. Bioorg Med Chem Lett 15:93-8 (2004)  
Target
Name:
Trypsin
Synonyms:
TRYP_PIG
Type:
PROTEIN
Mol. Mass.:
24411.24
Organism:
Sus scrofa
Description:
ChEMBL_1450738
Residue:
231
  
Inhibitor
Name:
BDBM50157093
Synonyms:
6-[2-(1-Cyclohexyl-2-methyl-1,2,3,4-tetrahydro-isoquinolin-7-yl)-cyclopropyl]-naphthalene-2-carboxamidine | CHEMBL182547
Type:
Small organic molecule
Emp. Form.:
C30H35N3
Mol. Mass.:
437.619
SMILES:
CN1CCc2ccc(cc2C1C1CCCCC1)C1CC1c1ccc2cc(ccc2c1)C(N)=N
: