Target
Plasminogen
Ligand
BDBM50157093
Substrate
Meas. Tech.
ChEMBL_302472 (CHEMBL826337)
Ki
811.0±n/a nM
Citation
 Bruncko, MMcClellan, WJWendt, MDSauer, DRGeyer, ADalton, CRKaminski, MAWeitzberg, MGong, JDellaria, JFMantei, RZhao, XNienaber, VLStewart, KKlinghofer, VBouska, JRockway, TWGiranda, VL Naphthamidine urokinase plasminogen activator inhibitors with improved pharmacokinetic properties. Bioorg Med Chem Lett 15:93-8 (2004)  
Target
Name:
Plasminogen
Synonyms:
Activation peptide PLG Plasmin Plasmin heavy chain A, short form | Plasmin light chain B
Type:
Enzyme
Mol. Mass.:
90579.18
Organism:
Homo sapiens (Human)
Description:
Residue:
810
  
Inhibitor
Name:
BDBM50157093
Synonyms:
6-[2-(1-Cyclohexyl-2-methyl-1,2,3,4-tetrahydro-isoquinolin-7-yl)-cyclopropyl]-naphthalene-2-carboxamidine | CHEMBL182547
Type:
Small organic molecule
Emp. Form.:
C30H35N3
Mol. Mass.:
437.619
SMILES:
CN1CCc2ccc(cc2C1C1CCCCC1)C1CC1c1ccc2cc(ccc2c1)C(N)=N
: