Target
DNA polymerase III PolC-type
Ligand
BDBM50160360
Substrate
Meas. Tech.
ChEMBL_303023 (CHEMBL830411)
Ki
93±n/a nM
Citation
 Wright, GEBrown, NCXu, WCLong, ZYZhi, CGambino, JJBarnes, MHButler, MM Active site directed inhibitors of replication-specific bacterial DNA polymerases. Bioorg Med Chem Lett 15:729-32 (2005)  
Target
Name:
DNA polymerase III PolC-type
Synonyms:
DNA polymerase III DNA-directed DNA polymerase PolIII mutI | polC
Type:
Enzyme
Mol. Mass.:
162625.67
Organism:
Bacillus subtilis
Description:
Enzyme was purified from recombinant strains.
Residue:
1437
  
Inhibitor
Name:
BDBM50160360
Synonyms:
2-(3,4-Dichloro-benzylamino)-7-(5-methanesulfinyl-pentyl)-1,7-dihydro-purin-6-one | CHEMBL183503
Type:
Small organic molecule
Emp. Form.:
C18H21Cl2N5O2S
Mol. Mass.:
442.363
SMILES:
CS(=O)CCCCCn1cnc2nc(NCc3ccc(Cl)c(Cl)c3)[nH]c(=O)c12
: