Target
Sodium channel protein type 9 subunit alpha
Ligand
BDBM50164051
Substrate
Meas. Tech.
ChEMBL_313003 (CHEMBL874197)
IC50
2300±n/a nM
Citation
 Shao, PPOk, DFisher, MHGarcia, MLKaczorowski, GJLi, CLyons, KAMartin, WJMeinke, PTPriest, BTSmith, MMWyvratt, MJYe, FParsons, WH Novel cyclopentane dicarboxamide sodium channel blockers as a potential treatment for chronic pain. Bioorg Med Chem Lett 15:1901-7 (2005)  
Target
Name:
Sodium channel protein type 9 subunit alpha
Synonyms:
NENA Peripheral sodium channel 1 SCN9A_HUMAN Voltage-gated sodium channel subunit Nav1.7 hNE-Na
Type:
Protein
Mol. Mass.:
226375.97
Organism:
Homo sapiens (Human)
Description:
Q15858
Residue:
1988
  
Inhibitor
Name:
BDBM50164051
Synonyms:
(1S,2S)-2-[(2''-Methoxy-biphenyl-4-ylmethyl)-amino]-cyclopentanecarboxylic acid ([2,2'']bithiophenyl-5-ylmethyl)-amide | CHEMBL359836
Type:
Small organic molecule
Emp. Form.:
C29H30N2O2S2
Mol. Mass.:
502.691
SMILES:
COc1ccccc1-c1ccc(CN[C@H]2CCC[C@@H]2C(=O)NCc2ccc(s2)-c2cccs2)cc1
: