Target
5-hydroxytryptamine receptor 2A
Ligand
BDBM50169268
Substrate
Meas. Tech.
ChEMBL_303106 (CHEMBL829616)
Ki
43±n/a nM
Citation
 Röver, SAdams, DRBénardeau, ABentley, JMBickerdike, MJBourson, ACliffe, IACoassolo, PDavidson, JEDourish, CTHebeisen, PKennett, GAKnight, ARMalcolm, CSMattei, PMisra, AMizrahi, JMuller, MPorter, RHRichter, HTaylor, SVickers, SP Identification of 4-methyl-1,2,3,4,10,10a-hexahydropyrazino[1,2-a]indoles as 5-HT2C receptor agonists. Bioorg Med Chem Lett 15:3604-8 (2005)  
Target
Name:
5-hydroxytryptamine receptor 2A
Synonyms:
5-HT-2 5-HT2A 5-hydroxytryptamine receptor 2A (5HT-2A) 5HT2A_HUMAN HTR2A | Serotonin receptor 2A
Type:
undefined
Mol. Mass.:
52607.65
Organism:
Homo sapiens (Human)
Description:
P28223
Residue:
471
  
Inhibitor
Name:
BDBM50169268
Synonyms:
(4R,10aR)-4,6-Dimethyl-1,2,3,4,10,10a-hexahydro-pyrazino[1,2-a]indole | CHEMBL190584
Type:
Small organic molecule
Emp. Form.:
C13H18N2
Mol. Mass.:
202.2954
SMILES:
C[C@@H]1CNC[C@H]2Cc3cccc(C)c3N12
: