Target
Cytochrome P450 1A2
Ligand
BDBM50410444
Substrate
Meas. Tech.
ChEMBL_321392 (CHEMBL880627)
IC50
5249±n/a nM
Citation
 Chua, PCNagasawa, JYBleicher, LSMunoz, BSchweiger, EJTehrani, LAnderson, JJCramer, MChung, JGreen, MDKing, CDReyes-Manalo, GCosford, ND Cyclohexenyl- and dehydropiperidinyl-alkynyl pyridines as potent metabotropic glutamate subtype 5 (mGlu5) receptor antagonists. Bioorg Med Chem Lett 15:4589-93 (2005)  
Target
Name:
Cytochrome P450 1A2
Synonyms:
CP1A2_HUMAN CYPIA2 Cytochrome P(3)450 Cytochrome P450 1A2 (CYP1A2) Cytochrome P450-P3
Type:
Enzyme
Mol. Mass.:
58423.38
Organism:
Homo sapiens (Human)
Description:
P05177
Residue:
516
  
Inhibitor
Name:
BDBM50410444
Synonyms:
CHEMBL2113099
Type:
Small organic molecule
Emp. Form.:
C21H16N2O2
Mol. Mass.:
328.3639
SMILES:
O=C1N(C2CCCC(=C2)C#Cc2ccccn2)C(=O)c2ccccc12
: