Target
11-beta-hydroxysteroid dehydrogenase 1
Ligand
BDBM50174289
Substrate
Meas. Tech.
ChEMBL_326693 (CHEMBL868712)
IC50
170±n/a nM
Citation
 Gu, XDragovic, JKoo, GCKoprak, SLLeGrand, CMundt, SSShah, KSpringer, MSTan, EYThieringer, RHermanowski-Vosatka, AZokian, HJBalkovec, JMWaddell, ST Discovery of 4-heteroarylbicyclo[2.2.2]octyltriazoles as potent and selective inhibitors of 11beta-HSD1: novel therapeutic agents for the treatment of metabolic syndrome. Bioorg Med Chem Lett 15:5266-9 (2005)  
Target
Name:
11-beta-hydroxysteroid dehydrogenase 1
Synonyms:
11-DH 11-beta-Hydroxysteroid Dehydrogenase 1 (11-beta-HSD1) 11-beta-hydroxysteroid dehydrogenase 1 (11HSD1) Corticosteroid 11-beta-dehydrogenase isozyme 1 (11-beta-HSD-1) Corticosteroid 11-beta-dehydrogenase isozyme 1 (11beta-HSD1) HSD11 HSD11L | SDR26C1
Type:
Enzyme
Mol. Mass.:
32409.16
Organism:
Homo sapiens (Human)
Description:
P28845
Residue:
292
  
Inhibitor
Name:
BDBM50174289
Synonyms:
3-(4-(3-(cyclopropylmethyl)-1,2,4-oxadiazol-5-yl)bicyclo[2.2.2]octan-1-yl)-5,6,7,8,9,10-hexahydro-[1,2,4]triazolo[4,3-a]azocine | CHEMBL200365
Type:
Small organic molecule
Emp. Form.:
C22H31N5O
Mol. Mass.:
381.5144
SMILES:
C(C1CC1)c1noc(n1)C12CCC(CC1)(CC2)c1nnc2CCCCCCn12
: