Target
11-beta-hydroxysteroid dehydrogenase type 2
Ligand
BDBM50174294
Substrate
Meas. Tech.
ChEMBL_326696 (CHEMBL868715)
IC50
>4000±n/a nM
Citation
 Gu, XDragovic, JKoo, GCKoprak, SLLeGrand, CMundt, SSShah, KSpringer, MSTan, EYThieringer, RHermanowski-Vosatka, AZokian, HJBalkovec, JMWaddell, ST Discovery of 4-heteroarylbicyclo[2.2.2]octyltriazoles as potent and selective inhibitors of 11beta-HSD1: novel therapeutic agents for the treatment of metabolic syndrome. Bioorg Med Chem Lett 15:5266-9 (2005)  
Target
Name:
11-beta-hydroxysteroid dehydrogenase type 2
Synonyms:
11-DH2 11-beta-Hydroxysteroid Dehydrogenase 2 (11-beta-HSD2) Corticosteroid 11-beta-dehydrogenase isozyme 2 Hsd11b2 NAD-dependent 11-beta-hydroxysteroid dehydrogenase
Type:
Enzyme
Mol. Mass.:
42201.46
Organism:
Mus musculus (mouse)
Description:
Purified recombinant mouse 11beta-HSD2.
Residue:
386
  
Inhibitor
Name:
BDBM50174294
Synonyms:
CHEMBL200876 | methyl 4-(5,6,7,8,9,10-hexahydro-[1,2,4]triazolo[4,3-a]azocin-3-yl)bicyclo[2.2.2]octane-1-carboxylate
Type:
Small organic molecule
Emp. Form.:
C18H27N3O2
Mol. Mass.:
317.4259
SMILES:
COC(=O)C12CCC(CC1)(CC2)c1nnc2CCCCCCn12
: