Target
11-beta-hydroxysteroid dehydrogenase 1
Ligand
BDBM50174295
Substrate
Meas. Tech.
ChEMBL_326693 (CHEMBL868712)
IC50
1.9±n/a nM
Citation
 Gu, XDragovic, JKoo, GCKoprak, SLLeGrand, CMundt, SSShah, KSpringer, MSTan, EYThieringer, RHermanowski-Vosatka, AZokian, HJBalkovec, JMWaddell, ST Discovery of 4-heteroarylbicyclo[2.2.2]octyltriazoles as potent and selective inhibitors of 11beta-HSD1: novel therapeutic agents for the treatment of metabolic syndrome. Bioorg Med Chem Lett 15:5266-9 (2005)  
Target
Name:
11-beta-hydroxysteroid dehydrogenase 1
Synonyms:
11-DH 11-beta-Hydroxysteroid Dehydrogenase 1 (11-beta-HSD1) 11-beta-hydroxysteroid dehydrogenase 1 (11HSD1) Corticosteroid 11-beta-dehydrogenase isozyme 1 (11-beta-HSD-1) Corticosteroid 11-beta-dehydrogenase isozyme 1 (11beta-HSD1) HSD11 HSD11L | SDR26C1
Type:
Enzyme
Mol. Mass.:
32409.16
Organism:
Homo sapiens (Human)
Description:
P28845
Residue:
292
  
Inhibitor
Name:
BDBM50174295
Synonyms:
4-methyl-3-(2-(trifluoromethyl)phenyl)-5-(4-(3-(4-(trifluoromethylsulfonyl)phenyl)-1,2,4-oxadiazol-5-yl)bicyclo[2.2.2]octan-1-yl)-4H-1,2,4-triazole | CHEMBL370362
Type:
Small organic molecule
Emp. Form.:
C27H23F6N5O3S
Mol. Mass.:
611.559
SMILES:
Cn1c(nnc1C12CCC(CC1)(CC2)c1nc(no1)-c1ccc(cc1)S(=O)(=O)C(F)(F)F)-c1ccccc1C(F)(F)F
: