Target
11-beta-hydroxysteroid dehydrogenase 1
Ligand
BDBM50174278
Substrate
Meas. Tech.
ChEMBL_326693 (CHEMBL868712)
IC50
4.1±n/a nM
Citation
 Gu, XDragovic, JKoo, GCKoprak, SLLeGrand, CMundt, SSShah, KSpringer, MSTan, EYThieringer, RHermanowski-Vosatka, AZokian, HJBalkovec, JMWaddell, ST Discovery of 4-heteroarylbicyclo[2.2.2]octyltriazoles as potent and selective inhibitors of 11beta-HSD1: novel therapeutic agents for the treatment of metabolic syndrome. Bioorg Med Chem Lett 15:5266-9 (2005)  
Target
Name:
11-beta-hydroxysteroid dehydrogenase 1
Synonyms:
11-DH 11-beta-Hydroxysteroid Dehydrogenase 1 (11-beta-HSD1) 11-beta-hydroxysteroid dehydrogenase 1 (11HSD1) Corticosteroid 11-beta-dehydrogenase isozyme 1 (11-beta-HSD-1) Corticosteroid 11-beta-dehydrogenase isozyme 1 (11beta-HSD1) HSD11 HSD11L | SDR26C1
Type:
Enzyme
Mol. Mass.:
32409.16
Organism:
Homo sapiens (Human)
Description:
P28845
Residue:
292
  
Inhibitor
Name:
BDBM50174278
Synonyms:
2-methoxy-5-(5-(4-(4-methyl-5-(2-(trifluoromethyl)phenyl)-4H-1,2,4-triazol-3-yl)bicyclo[2.2.2]octan-1-yl)-1,2,4-oxadiazol-3-yl)pyridine | CHEMBL426835
Type:
Small organic molecule
Emp. Form.:
C26H25F3N6O2
Mol. Mass.:
510.5109
SMILES:
COc1ccc(cn1)-c1noc(n1)C12CCC(CC1)(CC2)c1nnc(-c2ccccc2C(F)(F)F)n1C
: