Target
Cytochrome P450 3A4
Ligand
BDBM50175839
Substrate
Meas. Tech.
ChEMBL_334185 (CHEMBL867137)
IC50
>20000±n/a nM
Citation
 Berlin, MTing, PCVaccaro, WDAslanian, RMcCormick, KDLee, JFAlbanese, MMMutahi, MWPiwinski, JJShih, NYDuguma, LSolomon, DMZhou, WSher, RFavreau, LBryant, MKorfmacher, WANardo, CWest, REAnthes, JCWilliams, SMWu, RLSusan She, HRivelli, MACorboz, MRHey, JA Reduction of CYP450 inhibition in the 4-[(1H-imidazol-4-yl)methyl]piperidine series of histamine H3 receptor antagonists. Bioorg Med Chem Lett 16:989-94 (2006)  
Target
Name:
Cytochrome P450 3A4
Synonyms:
Albendazole monooxygenase CP3A4_HUMAN CYP3A4 CYPIIIA4 Cytochrome P450 3A4 (CYP3A4) Nifedipine oxidase Taurochenodeoxycholate 6-alpha-hydroxylase
Type:
Enzyme
Mol. Mass.:
57349.57
Organism:
Homo sapiens (Human)
Description:
Residue:
503
  
Inhibitor
Name:
BDBM50175839
Synonyms:
4-((1H-imidazol-4-yl)methyl)-1-(3-phenoxypropyl)piperidine | CHEMBL200267
Type:
Small organic molecule
Emp. Form.:
C18H25N3O
Mol. Mass.:
299.4106
SMILES:
C(COc1ccccc1)CN1CCC(Cc2cnc[nH]2)CC1
: