Target
Metabotropic glutamate receptor 5
Ligand
BDBM86716
Substrate
Meas. Tech.
ChEMBL_335664 (CHEMBL860564)
IC50
330±n/a nM
Citation
 Wållberg, ANilsson, KOsterlund, KPeterson, AElg, SRaboisson, PBauer, UHammerland, LGMattsson, JP Phenyl ureas of creatinine as mGluR5 antagonists. A structure-activity relationship study of fenobam analogues. Bioorg Med Chem Lett 16:1142-5 (2006)  
Target
Name:
Metabotropic glutamate receptor 5
Synonyms:
GPRC1E GRM5_HUMAN metabotropic glutamate 5 | metabotropic glutamate 5a
Type:
Enzyme
Mol. Mass.:
132484.72
Organism:
Homo sapiens (Human)
Description:
Residue:
1212
  
Inhibitor
Name:
BDBM86716
Synonyms:
CAS_63540-28-3 Fenobam | NSC_216215
Type:
Small organic molecule
Emp. Form.:
C11H11ClN4O2
Mol. Mass.:
266.684
SMILES:
Cn1cc(O)nc1NC(=O)Nc1cccc(Cl)c1
: