Target
Proteinase-activated receptor 4
Ligand
BDBM176019
Substrate
Meas. Tech.
ChEMBL_2234808 (CHEMBL5148580)
IC50
0.500000±n/a nM
Citation
 Priestley, ESBanville, JDeon, DDubé, LGagnon, MGuy, JLapointe, PLavallée, JFMartel, APlamondon, SRémillard, RRuediger, ETremblay, FPosy, SLGuarino, VRRichter, JMLi, JGupta, AVetrichelvan, MBalapragalathan, TJMathur, AHua, JCallejo, MGuay, JSum, CSCvijic, MEWatson, CWong, PYang, JBouvier, MGordon, DAWexler, RRMarinier, A Discovery of Two Novel Antiplatelet Clinical Candidates (BMS-986120 and BMS-986141) That Antagonize Protease-Activated Receptor 4. J Med Chem 65:8843-8854 (2022) Target
Name:
Proteinase-activated receptor 4
Synonyms:
Coagulation factor II receptor-like 3 PAR-4 PAR4_HUMAN Proteinase-activated receptor 4 (PAR4) | Thrombin receptor-like 3
Type:
Protein
Mol. Mass.:
41145.16
Organism:
Homo sapiens (Human)
Description:
Q96RI0
Residue:
385
  
Inhibitor
Name:
BDBM176019
Synonyms:
US10047103, 52 | US9688695, 52
Type:
Small organic molecule
Emp. Form.:
C21H20N4O4S2
Mol. Mass.:
456.538
SMILES:
COc1nn2cc(nc2s1)-c1cc2c(OCc3csc(n3)C(C)C)cc(OC)cc2o1
: