Target
Proteinase-activated receptor 4
Ligand
BDBM176063
Substrate
Meas. Tech.
ChEMBL_2234808 (CHEMBL5148580)
IC50
0.600000±n/a nM
Citation
 Priestley, ESBanville, JDeon, DDubé, LGagnon, MGuy, JLapointe, PLavallée, JFMartel, APlamondon, SRémillard, RRuediger, ETremblay, FPosy, SLGuarino, VRRichter, JMLi, JGupta, AVetrichelvan, MBalapragalathan, TJMathur, AHua, JCallejo, MGuay, JSum, CSCvijic, MEWatson, CWong, PYang, JBouvier, MGordon, DAWexler, RRMarinier, A Discovery of Two Novel Antiplatelet Clinical Candidates (BMS-986120 and BMS-986141) That Antagonize Protease-Activated Receptor 4. J Med Chem 65:8843-8854 (2022) Target
Name:
Proteinase-activated receptor 4
Synonyms:
Coagulation factor II receptor-like 3 PAR-4 PAR4_HUMAN Proteinase-activated receptor 4 (PAR4) | Thrombin receptor-like 3
Type:
Protein
Mol. Mass.:
41145.16
Organism:
Homo sapiens (Human)
Description:
Q96RI0
Residue:
385
  
Inhibitor
Name:
BDBM176063
Synonyms:
US10047103, 96 | US9688695, 96
Type:
Small organic molecule
Emp. Form.:
C22H21N5O6S
Mol. Mass.:
483.497
SMILES:
COc1nn2cc(nc2s1)-c1cc2c(OCc3coc(n3)N3CCOCC3)cc(OC)cc2o1
: