Target
Proteinase-activated receptor 4
Ligand
BDBM176003
Substrate
Meas. Tech.
ChEMBL_2234808 (CHEMBL5148580)
IC50
0.400000±n/a nM
Citation
 Priestley, ESBanville, JDeon, DDubé, LGagnon, MGuy, JLapointe, PLavallée, JFMartel, APlamondon, SRémillard, RRuediger, ETremblay, FPosy, SLGuarino, VRRichter, JMLi, JGupta, AVetrichelvan, MBalapragalathan, TJMathur, AHua, JCallejo, MGuay, JSum, CSCvijic, MEWatson, CWong, PYang, JBouvier, MGordon, DAWexler, RRMarinier, A Discovery of Two Novel Antiplatelet Clinical Candidates (BMS-986120 and BMS-986141) That Antagonize Protease-Activated Receptor 4. J Med Chem 65:8843-8854 (2022) Target
Name:
Proteinase-activated receptor 4
Synonyms:
Coagulation factor II receptor-like 3 PAR-4 PAR4_HUMAN Proteinase-activated receptor 4 (PAR4) | Thrombin receptor-like 3
Type:
Protein
Mol. Mass.:
41145.16
Organism:
Homo sapiens (Human)
Description:
Q96RI0
Residue:
385
  
Inhibitor
Name:
BDBM176003
Synonyms:
US10047103, 36 | US9688695, 36
Type:
Small organic molecule
Emp. Form.:
C27H23N5O5S2
Mol. Mass.:
561.632
SMILES:
COc1nn2cc(nc2s1)-c1cc2c(OCc3csc(n3)-c3ccc(cc3)C(=O)N(C)C)cc(OC)cc2o1
: