Target
Histamine H1 receptor
Ligand
BDBM50601574
Substrate
Meas. Tech.
ChEMBL_2237559 (CHEMBL5151455)
Kd
4.5±n/a nM
Citation
 Tropmann, KBresinsky, MForster, LMönnich, DBuschauer, AWittmann, HJHübner, HGmeiner, PPockes, SStrasser, A Abolishing Dopamine D J Med Chem 64:8684-8709 (2021) Target
Name:
Histamine H1 receptor
Synonyms:
H1R HISTAMINE H1 HRH1_HUMAN
Type:
G Protein-Coupled Receptor (GPCR)
Mol. Mass.:
55808.72
Organism:
Homo sapiens (Human)
Description:
Cell pellets from SK-N-MC cells transfected with human H1 receptor were used in binding assay.
Residue:
487
  
Inhibitor
Name:
BDBM50601574
Synonyms:
CHEMBL5201074
Type:
Small organic molecule
Emp. Form.:
C15H23Cl2N7O
Mol. Mass.:
388.295
SMILES:
Cl.Cl.C[C@@H](NC(=O)\N=C(/N)NCCCc1ncn[nH]1)c1ccccc1
: