Target
Histamine H1 receptor
Ligand
BDBM50601588
Substrate
Meas. Tech.
ChEMBL_2237559 (CHEMBL5151455)
Kd
4.5±n/a nM
Citation
 Tropmann, KBresinsky, MForster, LMönnich, DBuschauer, AWittmann, HJHübner, HGmeiner, PPockes, SStrasser, A Abolishing Dopamine D J Med Chem 64:8684-8709 (2021) Target
Name:
Histamine H1 receptor
Synonyms:
H1R HISTAMINE H1 HRH1_HUMAN
Type:
G Protein-Coupled Receptor (GPCR)
Mol. Mass.:
55808.72
Organism:
Homo sapiens (Human)
Description:
Cell pellets from SK-N-MC cells transfected with human H1 receptor were used in binding assay.
Residue:
487
  
Inhibitor
Name:
BDBM50601588
Synonyms:
CHEMBL5174278
Type:
Small organic molecule
Emp. Form.:
C38H42F12N12O10S2
Mol. Mass.:
1118.925
SMILES:
OC(=O)C(F)(F)F.OC(=O)C(F)(F)F.OC(=O)C(F)(F)F.OC(=O)C(F)(F)F.Cc1nc(N)sc1-c1cccc(N\C(N)=N\C(=O)NCCCCCCNC(=O)\N=C(/N)Nc2cccc(c2)-c2sc(N)nc2C)c1
: