Target
Histamine H1 receptor
Ligand
BDBM50601591
Substrate
Meas. Tech.
ChEMBL_2237559 (CHEMBL5151455)
Kd
4.5±n/a nM
Citation
 Tropmann, KBresinsky, MForster, LMönnich, DBuschauer, AWittmann, HJHübner, HGmeiner, PPockes, SStrasser, A Abolishing Dopamine D J Med Chem 64:8684-8709 (2021) Target
Name:
Histamine H1 receptor
Synonyms:
H1R HISTAMINE H1 HRH1_HUMAN
Type:
G Protein-Coupled Receptor (GPCR)
Mol. Mass.:
55808.72
Organism:
Homo sapiens (Human)
Description:
Cell pellets from SK-N-MC cells transfected with human H1 receptor were used in binding assay.
Residue:
487
  
Inhibitor
Name:
BDBM50601591
Synonyms:
CHEMBL5187758
Type:
Small organic molecule
Emp. Form.:
C15H25F3N6O3S
Mol. Mass.:
426.458
SMILES:
OC(=O)C(F)(F)F.CCCCCNC(=O)\N=C(\N)NCCCc1nnc(C)s1
: