Target
Alpha-1A adrenergic receptor
Ligand
BDBM50182020
Substrate
Meas. Tech.
ChEMBL_346848 (CHEMBL861838)
Ki
413±n/a nM
Citation
 Prabhakaran, JParsey, RVMajo, VJHsiung, SCMilak, MSTamir, HSimpson, NRVan Heertum, RLMann, JJDileep Kumar, JS Synthesis, in vitro and in vivo evaluation of [O-methyl-11C] 2-{4-[4-(3-methoxyphenyl)piperazin-1-yl]-butyl}-4-methyl-2H-[1,2,4]-triazine-3,5-dione: a novel agonist 5-HT1A receptor PET ligand. Bioorg Med Chem Lett 16:2101-4 (2006)  
Target
Name:
Alpha-1A adrenergic receptor
Synonyms:
ADA1A_HUMAN ADRA1C Alpha 1A-adrenoceptor Alpha adrenergic receptor 1a Alpha-adrenergic receptor 1c adrenergic Alpha1 | adrenergic Alpha1C
Type:
Cell-surface receptors
Mol. Mass.:
51511.67
Organism:
Homo sapiens (Human)
Description:
P35348
Residue:
466
  
Inhibitor
Name:
BDBM50182020
Synonyms:
2-(4-(4-(3-methoxyphenyl)piperazin-1-yl)butyl)-4-methyl-1,2,4-triazine-3,5(2H,4H)-dione | CHEMBL426317
Type:
Small organic molecule
Emp. Form.:
C19H27N5O3
Mol. Mass.:
373.4494
SMILES:
COc1cccc(c1)N1CCN(CCCCn2ncc(=O)n(C)c2=O)CC1
: