Target
Alpha-2A adrenergic receptor
Ligand
BDBM50182020
Substrate
Meas. Tech.
ChEMBL_346845 (CHEMBL861835)
Ki
250±n/a nM
Citation
 Prabhakaran, JParsey, RVMajo, VJHsiung, SCMilak, MSTamir, HSimpson, NRVan Heertum, RLMann, JJDileep Kumar, JS Synthesis, in vitro and in vivo evaluation of [O-methyl-11C] 2-{4-[4-(3-methoxyphenyl)piperazin-1-yl]-butyl}-4-methyl-2H-[1,2,4]-triazine-3,5-dione: a novel agonist 5-HT1A receptor PET ligand. Bioorg Med Chem Lett 16:2101-4 (2006)  
Target
Name:
Alpha-2A adrenergic receptor
Synonyms:
ADA2A_HUMAN ADRA2R Adrenergic alpha2A Alpha-2 adrenergic receptor subtype C10 Alpha-2A adrenoreceptor alpha-2A adrenergic receptor [Homo sapiens]
Type:
Enzyme
Mol. Mass.:
48979.91
Organism:
Homo sapiens (Human)
Description:
P08913
Residue:
465
  
Inhibitor
Name:
BDBM50182020
Synonyms:
2-(4-(4-(3-methoxyphenyl)piperazin-1-yl)butyl)-4-methyl-1,2,4-triazine-3,5(2H,4H)-dione | CHEMBL426317
Type:
Small organic molecule
Emp. Form.:
C19H27N5O3
Mol. Mass.:
373.4494
SMILES:
COc1cccc(c1)N1CCN(CCCCn2ncc(=O)n(C)c2=O)CC1
: