Target
Monoglyceride lipase
Ligand
BDBM50605691
Substrate
Meas. Tech.
ChEMBL_2252660 (CHEMBL5166870)
IC50
13±n/a nM
Citation
 Bononi, GDi Stefano, MPoli, GOrtore, GMeier, PMasetto, FCaligiuri, IRizzolio, FMacchia, MChicca, AAvan, AGiovannetti, EVagaggini, CBrai, ADreassi, EValoti, MMinutolo, FGranchi, CGertsch, JTuccinardi, T Reversible Monoacylglycerol Lipase Inhibitors: Discovery of a New Class of Benzylpiperidine Derivatives. J Med Chem 65:7118-7140 (2022) Target
Name:
Monoglyceride lipase
Synonyms:
HU-K5 Lysophospholipase-like MGL MGLL_HUMAN
Type:
Hydrolase
Mol. Mass.:
33264.56
Organism:
Homo sapiens (Human)
Description:
Human recombinant MGL (Cayman Chemical, cat# 10008354).
Residue:
303
  
Inhibitor
Name:
BDBM50605691
Synonyms:
CHEMBL5206906
Type:
Small organic molecule
Emp. Form.:
C25H23F3N2O3
Mol. Mass.:
456.4569
SMILES:
Oc1cccc(c1)C(=O)N1CCC(Cc2cccc(Oc3cc(ccn3)C(F)(F)F)c2)CC1
: