Target
Prostaglandin G/H synthase 1
Ligand
BDBM50188301
Substrate
Meas. Tech.
ChEMBL_378653 (CHEMBL871489)
IC50
3000±n/a nM
Citation
 Birkinshaw, TNTeague, SJBeech, CBonnert, RVHill, SPatel, AReakes, SSanganee, HDougall, IGPhillips, TTSalter, SSchmidt, JArrowsmith, ECCarrillo, JJBell, FMPaine, SWWeaver, R Discovery of potent CRTh2 (DP2) receptor antagonists. Bioorg Med Chem Lett 16:4287-90 (2006)  
Target
Name:
Prostaglandin G/H synthase 1
Synonyms:
COX-1 Cyclooxygenase Cyclooxygenase-1 (COX-1) PTGS1 | Prostaglandin G/H synthase (cyclooxygenase)
Type:
Enzyme
Mol. Mass.:
68692.62
Organism:
Homo sapiens (Human)
Description:
P23219
Residue:
599
  
Inhibitor
Name:
BDBM50188301
Synonyms:
2-(2,5-dimethyl-3-(8-methylquinolin-4-yl)-1H-indol-1-yl)acetic acid | CHEMBL209689
Type:
Small organic molecule
Emp. Form.:
C22H20N2O2
Mol. Mass.:
344.4064
SMILES:
Cc1c(-c2ccnc3c(C)cccc23)c2cc(C)ccc2n1CC(O)=O
: