Target
Prostaglandin G/H synthase 1
Ligand
BDBM50188307
Substrate
Meas. Tech.
ChEMBL_378653 (CHEMBL871489)
IC50
400±n/a nM
Citation
 Birkinshaw, TNTeague, SJBeech, CBonnert, RVHill, SPatel, AReakes, SSanganee, HDougall, IGPhillips, TTSalter, SSchmidt, JArrowsmith, ECCarrillo, JJBell, FMPaine, SWWeaver, R Discovery of potent CRTh2 (DP2) receptor antagonists. Bioorg Med Chem Lett 16:4287-90 (2006)  
Target
Name:
Prostaglandin G/H synthase 1
Synonyms:
COX-1 Cyclooxygenase Cyclooxygenase-1 (COX-1) PTGS1 | Prostaglandin G/H synthase (cyclooxygenase)
Type:
Enzyme
Mol. Mass.:
68692.62
Organism:
Homo sapiens (Human)
Description:
P23219
Residue:
599
  
Inhibitor
Name:
BDBM50188307
Synonyms:
2-(3-(7-chloroquinolin-4-yl)-2,5-dimethyl-1H-indol-1-yl)acetic acid | CHEMBL212777
Type:
Small organic molecule
Emp. Form.:
C21H17ClN2O2
Mol. Mass.:
364.825
SMILES:
Cc1c(-c2ccnc3cc(Cl)ccc23)c2cc(C)ccc2n1CC(O)=O
: