Target
Prostaglandin G/H synthase 1
Ligand
BDBM50188302
Substrate
Meas. Tech.
ChEMBL_378652 (CHEMBL871488)
IC50
40±n/a nM
Citation
 Birkinshaw, TNTeague, SJBeech, CBonnert, RVHill, SPatel, AReakes, SSanganee, HDougall, IGPhillips, TTSalter, SSchmidt, JArrowsmith, ECCarrillo, JJBell, FMPaine, SWWeaver, R Discovery of potent CRTh2 (DP2) receptor antagonists. Bioorg Med Chem Lett 16:4287-90 (2006)  
Target
Name:
Prostaglandin G/H synthase 1
Synonyms:
COX-1 Cyclooxygenase Cyclooxygenase-1 (COX-1) PTGS1 | Prostaglandin G/H synthase (cyclooxygenase)
Type:
Enzyme
Mol. Mass.:
68692.62
Organism:
Homo sapiens (Human)
Description:
P23219
Residue:
599
  
Inhibitor
Name:
BDBM50188302
Synonyms:
2-(1-(7-chloroquinolin-4-yl)-5-methoxy-2-methyl-1H-indol-3-yl)acetic acid | CHEMBL213029
Type:
Small organic molecule
Emp. Form.:
C21H17ClN2O3
Mol. Mass.:
380.824
SMILES:
COc1ccc2n(c(C)c(CC(O)=O)c2c1)-c1ccnc2cc(Cl)ccc12
: